EMBRC-FR
type: RegisterItem
item class: Concept
submitter: Hélène Bressan
status: statusExperimental
date accepted: 2022-04-07T14:48:34.468Z
date submitted: 2022-04-06T15:31:47.583Z
register: Infrastructures de Recherche et composantes
modified: 2023-09-19T07:44:54.136Z
definition:
  entity: EMBRC-FR
  source graph: graph
item class: Infra recherche
notation: c_1248ee15
version info: 4

Infrastructures de Recherche et composantes
type: Container
member: IAGOS
member: Jerico-S3
member: CLIMERI-France
member: DATA TERRA
member: EMSO
member: EPOS
member: eLTER
member: RECOLNAT
member: In-SYLVA-FR
member: eLTER-FR OZCAR
member: ACTRIS-FR
member: DISSCo
member: Pôle AERIS
member: EMPHASIS-FR
member: Pôle FORM@TER
member: eLTER-FR RZA
notation: InfraRecherche
type: Register
member: ICOS-FR
member: IBISBA-FR
description: liste des IRs et de leur composantes en fonction de la feuille de route du ministère https://www.enseignementsup-recherche.gouv.fr/sites/default/files/2022-03/feuille-de-route-nationale-des-infrastructures-de-recherche---2021-17054.pdf
member: IAGOS-FR
member: CEPMMT
type: ConceptScheme
version info: 5
member: RégEF
member: ILICO
member: Pôle THEIA
modified: 2023-11-10T11:07:37.803Z
member: RARe
member: ANAEE-FR
member: Pôle ODATIS
member: ACTRIS
member: EMSO-FR
member: EMBRC-FR
inverse membership predicate: inScheme
member: EURO-ARGO/ARGO
member: c 3d87e166
member: ICOS
member: Euro-ARGO France
member: ANAEE
member: MIRRI
is member of relation: inScheme
scope note: liste des IRs et de leur composantes en fonction de la feuille de route du ministère
member: PNDB

IAGOS
type: Concept
type: Infra euro
in scheme: Infrastructures de Recherche et composantes
top concept of: Infrastructures de Recherche et composantes
related: Pôle AERIS

Pôle AERIS
type: Concept
label: Pole AERIS @en
in scheme: Infrastructures de Recherche et composantes
member: DATA TERRA
broader: DATA TERRA

DATA TERRA
type: Infra recherche
related: Pôle ODATIS
description: Le système Terre est un système complexe intégrant des milieux physiques et vivants qui évoluent et interagissent entre eux à différentes échelles. Prévoir son évolution, anticiper les impacts et alerter des risques environnementaux sont des enjeux majeurs. Cela nécessite la collecte et l’analyse croisée de données issues de dispositifs d’observation (terre, mer, aéroporté, spatial), de modélisations et d’expérimentations. La complexité des processus étudiés, le nombre et la précision croissante des observations exigent d’intégrer des données multi-sources, multi-échelles, multi-types et de mieux quantifier leurs incertitudes. Data Terra, fondée sur quatre pôles (surfaces continentales, atmosphère, océans, Terre solide) et des services transversaux, développe un dispositif global d’accès et de traitement de données, produits et services pour : faciliter l’accès et l’utilisation de données et services FAIR, développer des services sur l’ensemble du cycle de la donnée et des approches interdisciplinaires pour les communautés scientifiques, les acteurs publiques et de l’innovation. Cette E-infrastructure du domaine de l’environnement – ouverte et interopérable – permet l’extraction, le croisement et un accès transparent et continu à des données multi-sources, multi-domaines et multi-organismes du système Terre. En Europe et à l’International, Data Terra contribue à EOSC, aux missions et applications spatiales et à la mise en œuvre de jumeaux numériques de la Terre.
narrower: Pôle AERIS
narrower: Pôle THEIA
related: PNDB
related: Pôle THEIA
type: Concept
narrower: PNDB
narrower: Pôle ODATIS
narrower: Pôle FORM@TER
top concept of: Infrastructures de Recherche et composantes
related: Pôle FORM@TER
related: Pôle AERIS
in scheme: Infrastructures de Recherche et composantes

Pôle ODATIS
type: Concept
label: Pole ODATIS @en
in scheme: Infrastructures de Recherche et composantes
member: DATA TERRA
broader: DATA TERRA

Pôle THEIA
type: Concept
label: Pole THEIA @en
in scheme: Infrastructures de Recherche et composantes
member: DATA TERRA
broader: DATA TERRA

PNDB
type: Infra recherche
in scheme: Infrastructures de Recherche et composantes
broader: DATA TERRA
description: Le PNDB est une infrastructure numérique nationale du Système Terre-Environnement, contribuant à la politique de Science ouverte du MESRI. Depuis 2020, il met à disposition un ensemble cohérent d’outils et services pour la description, la mise à disposition, la validation, l’analyse et la réutilisation des données de biodiversité, notamment à l’usage des recherches fondamentales ou finalisées. Il ambitionne de contribuer à construire un cadre scientifique intégratif prenant en compte la biodiversité sur le temps long (depuis les origines de la vie), à toutes les échelles biologiques (de la molécule à l’anthropo-écosystème), et dans toutes ses interactions (climat, activités humaines). Le PNDB a pour vocation de donner accès à des données produites par d’autres infrastructures, par des institutions ou par des communautés scientifiques, et à des outils permettant de les décrire (métadonnées) et de les traiter (croisement de données). Il contribue ainsi à favoriser la pérennité, l’interopérabilité, l’ouverture et la réutilisation des données de biodiversité, et à faire monter en compétence les communautés scientifiques concernées. Il offre une aide à la bancarisation. Il contribue à l’animation des communautés autour de la science ouverte et stimule les interactions entre producteurs et utilisateurs de données. La PNDB s’inscrit dans le paysage des infrastructures de données de biodiversité national (SIB, SINP, GBIF France…), européen (Lifewatch) et international (GBIF, GEO BON…).
related: DATA TERRA
alternative label: Pôle National de données de biodiversité
type: Concept

Pôle FORM@TER
type: Concept
in scheme: Infrastructures de Recherche et composantes
member: DATA TERRA
broader: DATA TERRA

Jerico-S3
type: Concept
top concept of: Infrastructures de Recherche et composantes
related: Pôle FORM@TER
related: Pôle ODATIS
in scheme: Infrastructures de Recherche et composantes
type: Infra euro

CLIMERI-France
type: Concept
description: CLIMERI-France est l’infrastructure de recherche nationale de modélisation du climat. Elle a pour mission la réalisation des simulations numériques internationales du Programme mondial de recherches sur le climat et la mise à disposition de leurs résultats. Ces expériences visent à comprendre le fonctionnement du système climatique, à évaluer les capacités des modèles de climat, à soutenir des études de mécanismes et de processus et à produire des projections de l’évolution future du climat. Ces expériences servent de référence pour les recherches en sciences du climat mais également pour des études d’impact du changement climatique dans différents secteurs, et contribuent à l’élaboration des rapports du GIEC. CLIMERI-France inclut les ressources humaines assurant la mise au point et la maintenance des codes et des outils nécessaires à leur utilisation, la préparation des versions de référence des codes, les outils d’’exploitation des données produites par les simulations, les ressources de calcul permettant la réalisation des expériences internationales et les capacités de stockage des données, en partie mis à disposition par GENCI, ainsi que l’infrastructure logicielle permettant la gestion et le contrôle du flux de données et de métadonnées. L’infrastructure met à disposition des codes numériques et des outils logiciels. Elle offre un service d’accès aux données et à une plateforme d’analyse des résultats des modèles climatiques globaux et régionaux.
type: Infra recherche
in scheme: Infrastructures de Recherche et composantes
top concept of: Infrastructures de Recherche et composantes

EMSO
type: Concept
type: Infra euro
related: Pôle FORM@TER
in scheme: Infrastructures de Recherche et composantes
related: Pôle ODATIS
top concept of: Infrastructures de Recherche et composantes

EPOS
type: Concept
type: Infra euro
in scheme: Infrastructures de Recherche et composantes
top concept of: Infrastructures de Recherche et composantes
related: Pôle FORM@TER

eLTER
type: Concept
type: Infra euro
in scheme: Infrastructures de Recherche et composantes
top concept of: Infrastructures de Recherche et composantes
related: Pôle THEIA

RECOLNAT
type: Infra recherche
related: DISSCo
in scheme: Infrastructures de Recherche et composantes
top concept of: Infrastructures de Recherche et composantes
type: Concept
related: Pôle THEIA
related: PNDB
description: Les collections naturalistes conservées en France représentent environ 120 millions d’objets. Ces archives de la biodiversité et de la géodiversité représentent aujourd’hui un patrimoine irremplaçable et sont des atouts indéniables pour la recherche scientifique présente et future. L’infrastructure RECOLNAT a pour mission générale de produire, mobiliser, rassembler, harmoniser et donner accès aux collections naturalistes et à leurs données. L’ambition est de pouvoir proposer aux communautés scientifiques des données naturalistes de qualité, à la bonne échelle, interopérables et dans le bon format, permettant de répondre aux grands enjeux environnementaux et sociétaux. Aussi, RECOLNAT vise à constituer un réseau d’excellence scientifique en rassemblant les acteurs de la conservation et de l’étude des collections naturalistes. Elle donne accès aux données via un portail rassemblant près de 11 millions d’images provenant de plus de 80 institutions (muséums, universités, etc.). Ce corpus est aussi enrichi par le programme de sciences participatives «Les Herbonautes», dont la communauté constitue des jeux de données pour des travaux de recherche sélectionnés. L’infrastructure met également à disposition des outils pour les chercheurs travaillant sur les doubles numériques des collections. Piloté par le Muséum national d’histoire naturelle, RECOLNAT constitue également le point nodal français de l’infrastructure européenne DiSSCo (Distributed System of Scientific Collections).

DISSCo
type: Concept
top concept of: Infrastructures de Recherche et composantes
in scheme: Infrastructures de Recherche et composantes
related: Pôle THEIA
type: Infra euro
related: PNDB

In-SYLVA-FR
type: Concept
top concept of: Infrastructures de Recherche et composantes
related: Pôle THEIA
in scheme: Infrastructures de Recherche et composantes
description: In-Sylva France est une Infrastructure Nationale de recherche (IR) distribuée pour la gestion adaptative des forêts. Elle contribue à favoriser une vision intégrée de la gestion des forêts pour permettre son adaptation au changement climatique, la protection de sa biodiversité et la production durable de services écosystémiques, prenant en compte la diversité des écosystèmes forestiers et des situations locales (pédoclimatiques, organisation filières, gouvernances locales). In-Sylva France procure des services pour l’observation et l’expérimentation forestière à tous les utilisateurs (académiques et gestionnaires) impliqués dans le Programme national de la forêt et du bois (PNFB). L’infrastructure dispose de réseaux expérimentaux nécessaires au phénotypage à grande échelle (Services In-situ), c’est-à-dire sur plus de 4 000 ha soit 3 000 sites installés pour étudier les interactions entre pratiques, ressources génétiques et environnement. Elle intègre des plateformes analytiques en écologie fonctionnelle, biogéochimie, xylosciences et génétique, dédiées aux mesures à haut-débit d’échantillons (Services In-lab) ainsi que de systèmes d’information et d’analyses pour la valorisation des données (Services In-silico). In-Sylva France alimente la recherche fondamentale et appliquée dans le domaine des sciences forestières. Son originalité est de coupler les leviers sylvicoles, biogéochimiques et génétiques. https://doi.org/10.15454/1A0P-HE21
type: Infra recherche
related: PNDB

eLTER-FR OZCAR
type: Infra recherche
related: DATA TERRA
related: Pôle THEIA
related: Pôle FORM@TER
type: Concept
related: eLTER
description: eLTER-France OZCAR est une IR distribuée mettant en réseau des sites instrumentant, sur le long terme, les différents compartiments de la Zone Critique des surfaces continentales : sol, sous-sol, eau, zones humides et glace. Il s’agit de mesurer en continu, modéliser et gérer les flux d’eau, de carbone et des éléments associés. Ces observatoires, véritables sentinelles des changements globaux, permettent d’aborder les grands enjeux scientifiques visant à une meilleure compréhension intégrée des stocks et des flux d’énergie et de matière à la surface des continents le long de gradients climatiques, topographiques, géologiques ou d’utilisation des terres. eLTER-France OZCAR est une IR essentielle pour obtenir une vision élargie et consolidée des changements environnementaux à l’œuvre sur les surfaces continentales, à l’échelle des territoires («des milieux»). Elle associe des observatoires de recherche élémentaires portés par les différents organismes de recherche qui les soutiennent. Elle offre une gouvernance et une méthodologie partagées au service de l’étude du fonctionnement et de l’évolution de la Zone Critique à l’heure de l’Anthropocène, pour la recherche, l’appui aux politiques publiques et le monde économique. Les services concernent la mise à disposition de sites densément instrumentés, le partage de leurs données, le partage d’un parc instrumental et l’innovation technologique, et la modélisation intégrée de la Zone Critique.
top concept of: Infrastructures de Recherche et composantes
in scheme: Infrastructures de Recherche et composantes

ACTRIS-FR
type: Infra recherche
related: Pôle AERIS
related: DATA TERRA
type: Concept
description: ACTRIS-FR est la composante française d’ACTRIS pour l’observation et l’exploration des aérosols, des nuages et des gaz réactifs et de leurs interactions. ACTRIS est une infrastructure de recherche européenne distribuée, en support des recherches sur le climat et la qualité de l’air. Elle permet d’améliorer la compréhension de l’évolution des processus et de la composition atmosphériques. ACTRIS fournit aux utilisateurs des informations sur la variabilité 4-D des espèces à temps de vie court avec un haut niveau de qualité, issues de plateformes d’observation et d’exploration. ACTRIS opère des plateformes centrales (centres de données et de calibration) et fournit des services destinés à une large communauté d’utilisateurs travaillant sur les modèles chimie/climat, sur la validation des données satellitaires ou sur l’analyse de la prévision du temps ou de la qualité de l’air. Enfin, ACTRIS propose des accès physiques ou à distance à ses plateformes au service des communautés scientifiques et du secteur privé favorisant ainsi la recherche, la formation et l’innovation technologique
top concept of: Infrastructures de Recherche et composantes
in scheme: Infrastructures de Recherche et composantes

EMPHASIS-FR
type: Concept
type: Infra recherche
in scheme: Infrastructures de Recherche et composantes
top concept of: Infrastructures de Recherche et composantes
related: PNDB

eLTER-FR RZA
type: Infra recherche
related: PNDB
related: DATA TERRA
related: Pôle FORM@TER
in scheme: Infrastructures de Recherche et composantes
related: eLTER
related: Pôle THEIA
top concept of: Infrastructures de Recherche et composantes
description: Le Réseau des Zones Ateliers (RZA, CNRS-INEE) incarne en France la recherche sur les socio-écosystèmes et le développement des sciences de la soutenabilité (Plateformes LTSER). Il aborde le fonctionnement et l’évolution des socio-écosystèmes sous l’emprise des différentes facettes du changement global. En appui très fort sur des approches disciplinaires au sein des champs des sciences de la nature (avec un accent marqué sur l’écologie) comme des sciences humaines et sociales (géographie, économie et droit, avec des ouvertures de plus en plus fortes vers la sociologie, l’anthropologie et les sciences sociales du politique), les ZAs stimulent des approches véritablement interdisciplinaires et des co-recherches entre chercheurs et acteurs des territoires. Le RZA et la diversité des ZAs qui le composent se veut donc à la fois (i) une mosaïque de laboratoires à ciel ouvert où ces approches inter- et transdisciplinaires peuvent se déployer, être testées pour accompagner les territoires dans leur transformation vers davantage de soutenabilité et (ii) un terrain pour penser en inter-ZA la question des changements d’échelle à travers des études comparatives et/ou le test d’hypothèses sur le fonctionnement et l’évolution des socio-écosystèmes, le long de gradients qui peuvent être climatiques, anthropiques, ou d’historique des relations chercheurs-acteurs. Le RZA, devenu IR en 2018, contribue avec l’IR OZCAR à la feuille de route européenne ESFRI via le nœud français d’eLTER.
type: Concept

ICOS-FR
type: Infra recherche etoile
top concept of: Infrastructures de Recherche et composantes
related: Pôle AERIS
in scheme: Infrastructures de Recherche et composantes
related: DATA TERRA
description: La mission de l’infrastructure ICOS est d’observer à haute résolution spatiale et au pas de temps journalier les variations des flux surface-atmosphère et des concentrations atmosphériques en gaz à effet de serre. L’infrastructure se compose d’un réseau de monitoring de haute précision, standardisé et à long terme des flux et concentrations en gaz à effet de serre. Elle intègre des observations standardisées de l’atmosphère, des surfaces continentales et des eaux de surface océaniques. Les observations produites par ICOS et mises à disposition de la communauté scientifique permettent d’explorer les processus à l’origine des échanges atmosphériques des océans et continents, de distinguer les composantes biogéniques, géophysiques et fossiles et d’observer les processus de transport atmosphérique. Elles participent aux observations globales de l’atmosphère terrestre et du climat. Les données produites par ICOS-RI constituent la base du suivi temporel spatialisé à haute résolution des émissions de gaz à effet de serre. Elles s’appliquent à l’estimation de bilans territoriaux, régionaux, nationaux et globaux de gaz à effet de serre et contribuent à la vérification des politiques énergétiques.
related: ICOS
type: Concept

ICOS
type: Concept
related: DATA TERRA
related: Pôle AERIS
related: Pôle THEIA
top concept of: Infrastructures de Recherche et composantes
type: Infra euro
related: Pôle ODATIS
in scheme: Infrastructures de Recherche et composantes

IBISBA-FR
type: Concept
type: Infra recherche
in scheme: Infrastructures de Recherche et composantes
top concept of: Infrastructures de Recherche et composantes
related: Pôle THEIA

IAGOS-FR
type: Infra recherche
in scheme: Infrastructures de Recherche et composantes
related: IAGOS
top concept of: Infrastructures de Recherche et composantes
related: DATA TERRA
type: Concept
related: Pôle AERIS
description: IAGOS est une infrastructure de recherche européenne, unique au monde, qui a pour objectif d’établir et d’opérer un réseau global d’observation à long terme de la composition de l’atmosphère : gaz traces réactifs (ozone, CO, NOx), gaz à effet de serre (H2O, CO2, méthane), aérosols et particules nuageuses (gouttes d’eau et cristaux de glace) grâce à des instruments automatiques embarqués sur une flotte d’une quinzaine d’avions de ligne (de type Airbus) appartenant à des compagnies aériennes internationales. Le but est de construire la plus dense base de données in-situ à haute résolution spatiale et temporelle sur plusieurs décennies pour surveiller l’évolution de la composition atmosphérique impliquée dans le changement climatique et la qualité de l’air. IAGOS a su démontrer que le vecteur avion commercial était la plateforme idéale pour des mesures in-situ à long terme dans la zone de l’atmosphère la plus critique vis-à-vis de l’effet de serre (la haute troposphère – basse stratosphère). Les mesures fournissent aussi des profils verticaux dans toute la troposphère entre la surface et 12 km d’altitude d’intérêt majeur pour les questions de qualité de l’air. Fin 2021, la base de données regroupe plus de 63 000 vols couvrant déjà plus de 25 ans. Ces observations sont exploitées par la communauté scientifique, les centres de prévisions météorologiques et de prévision de la qualité de l’air, le Service Atmosphérique du programme Copernicus (CAMS), et plus largement par GEOSS.

CEPMMT
type: OI
top concept of: Infrastructures de Recherche et composantes
type: Concept
alternative label: Centre Européen pour les Prévisions Météorologiques à Moyen Terme
description: Le Centre Européen pour les Prévisions Météorologiques à Moyen Terme est une organisation intergouvernementale indépendante créée en 1975 et actuellement financée par 34 États Membres. C’est à la fois un institut de recherche et un service opérationnel qui développe son modèle et son système global de Prévision Numérique du Temps, et l’opère 24h/24 7 j/7 pour élaborer et diffuser ses produits. Son centre de calcul et de données (ainsi que l’ensemble de l’archive correspondante) est accessible à tous ses États membres pour leurs activités de recherche. De ce fait, le CEPMMT est aussi un outil important pour la recherche sur le climat, et réalise notamment des ré-analyses du climat récent, basées sur son système de Prévision Numérique du Temps et l’ensemble des observations passées disponibles. Par ailleurs, le CEPMMT coordonne et met en œuvre les services atmosphère (chimie de l’atmosphère, qualité de l’air, émissions de gaz à effet de serre) et changement climatique du programme Copernicus de l’Union Européenne.
in scheme: Infrastructures de Recherche et composantes

RégEF
type: Projet infra
top concept of: Infrastructures de Recherche et composantes
in scheme: Infrastructures de Recherche et composantes
related: Pôle ODATIS
related: Pôle FORM@TER
related: Pôle AERIS
related: Pôle THEIA
type: Concept

ILICO
type: Infra recherche
top concept of: Infrastructures de Recherche et composantes
description: L’infrastructure de recherche littorale et côtière (ILICO) est l’infrastructure de recherche française dédiée à l’observation et à la compréhension des évolutions à long-terme des milieux marins côtiers et littoraux, de métropole et outre-mer. ILICO occupe une position stratégique de structuration de l’observation et de la recherche sur les milieux naturels situés à l’interface entre le Continent et l’Océan. L’IR fédère des dispositifs d’observation inter-organismes pérennes (dont 8 «Services Nationaux d’Observation» (SNO) labellisés). ILICO a également pour mission de veiller à ce que les observations dans les milieux littoraux et côtiers répondent aux enjeux sociétaux et questions scientifiques associées. Elle est garant de l’interopérabilité et de la qualité des observations effectuées par les différents systèmes d’observation. ILICO pilote un réseau d’animation scientifique qui assure la réflexion et la prospective scientifique transversale, et favorise l’interdisciplinarité, via des actions structurantes transversales. Ce réseau inter-organismes est composé de plus de 60 laboratoires (implantés en métropole et en outre-mer) qui mènent une recherche sur les milieux marins côtiers et littoraux. L’IR ILICO est le nœud français du projet d’infrastructure européenne en cours de construction JERICO-RI (Joint European Research Infrastructure for Coastal Observatories).
related: DATA TERRA
related: Pôle ODATIS
related: Jerico-S3
in scheme: Infrastructures de Recherche et composantes
type: Concept

RARe
type: Infra recherche
type: Concept
in scheme: Infrastructures de Recherche et composantes
description: RARe est l’infrastructure de référence pour sécuriser, documenter et distribuer les ressources de la biosphère du système Terre. Elle rassemble cinq réseaux de Centres de Ressources Biologiques (CRB) gérant des ressources biologiques animales, végétales, forestières, microbiennes et des matrices complexes issues de l’environnement, ainsi que les données associées (biologiques, génétiques, réglementaires et juridiques). Elle dispose d’un portail d’entrée unique qui permet d’explorer ces ressources. Le maintien d’une grande diversité de ressources place les CRB au cœur de nombreux programmes de recherche destinés à explorer le vivant et les écosystèmes et à valoriser la biodiversité pour l’agriculture, l’alimentation, l’environnement et la santé. L’infrastructure a pour but d’améliorer la visibilité de ces ressources et de faciliter leur utilisation pour la recherche au niveau national et international. Elle est membre du GGBN. Le pilier microbien de RARe participe à l’infrastructure MIRRI de la feuille de route ESFRI. Ces missions s’accompagnent d’une animation scientifique intersectorielle et de développements technologiques pour préserver et caractériser les ressources biologiques. L’infrastructure mutualise les compétences entre ses CRB constitutifs et harmonise leurs pratiques. La valorisation des ressources est réalisée en cohérence avec les politiques partenariales des organismes de tutelle. Elle propose des outils pour faciliter l’application du protocole de Nagoya
top concept of: Infrastructures de Recherche et composantes
related: MIRRI
related: PNDB
related: Pôle THEIA

MIRRI
type: Concept
type: Infra euro
in scheme: Infrastructures de Recherche et composantes
top concept of: Infrastructures de Recherche et composantes

ANAEE-FR
type: Infra recherche
related: ANAEE
description: L’infrastructure AnaEE France offre à la communauté scientifique, aux entreprises et aux organisations issues de la société civile un accès à des dispositifs expérimentaux dédiés à l’étude des écosystèmes continentaux terrestres et aquatiques et distribuées sur le territoire national métropolitain et ultramarin. L’infrastructure accompagne également la réalisation des projets de recherche en proposant un accès aux données et à ses plateformes analytiques. Spécifiquement, AnaEE France rassemble 33 dispositifs originaux permettant de manipuler les écosystèmes soit en conditions plus ou moins contrôlées soit en milieu ouvert en accédant à des expérimentations long terme offrant des milieux différentiés et des historiques documentés ou en réalisant des expérimentations nouvelles notamment dans des écosystèmes alpins et des forêts tropicales. Les plateformes AnaEE France offrent des outils de pointe de caractérisation des écosystèmes afin d’appréhender simultanément les variables d’état relatives aux organismes vivants et aux milieux, et les flux de matière et d’énergie. La capacité de caractérisation des écosystèmes est accrue au sein de l’infrastructure par la mise à disposition de 7 plateformes analytiques en laboratoire ou in situ dans le domaine de la génomique environnementale, de la biochimie des sols et de l’analyse des gaz. Pour valoriser les données acquises, l’infrastructure propose un système d’information permettant une diffusion ouverte selon les principes FAIR.
related: Pôle THEIA
related: PNDB
in scheme: Infrastructures de Recherche et composantes
type: Concept
top concept of: Infrastructures de Recherche et composantes

ANAEE
type: Infra euro
related: PNDB
top concept of: Infrastructures de Recherche et composantes
type: Concept
related: Pôle THEIA
in scheme: Infrastructures de Recherche et composantes

ACTRIS
type: Infra euro
related: DATA TERRA
top concept of: Infrastructures de Recherche et composantes
in scheme: Infrastructures de Recherche et composantes
related: Pôle AERIS
type: Concept

EMSO-FR
type: Concept
in scheme: Infrastructures de Recherche et composantes
related: Pôle ODATIS
related: EMSO
related: Pôle FORM@TER
description: EMSO France est le nœud français de l’infrastructure Européenne (ERIC) EMSO (« European Multidisciplinary Seafloor and water column Observatory ») qui met en œuvre les observatoires marins pluridisciplinaires distribués en milieu profond sur le pourtour européen. L’ERIC EMSO a pour objectif d’acquérir des séries temporelles longues et haute fréquence sur un point donné, à la fois sur le fond de l’océan et dans la colonne d’eau avec pour objectifs scientifiques principaux : 1) l’étude des processus sismiques, volcaniques, hydrothermaux et gravitaires ; 2) l’étude des écosystèmes marins profonds dans une optique de recherche fondamentale mais aussi de gestion durable, en particulier vis-à-vis des facteurs anthropiques et climatiques ; 3) la contribution au suivi des changements globaux. Sur chaque site, les installations sont composées d’équipements permettant d’acquérir les données d’observation en milieu marin profond, de systèmes qui assurent la communication bidirectionnelle entre les installations en mer et la Terre et des plateformes sur lesquelles les données acquises sont en accès libre. Les sites EMSO France sont situés aux Açores (depuis 2010), en mer Ligure (depuis 1988), en mer d’Iroise (site de test). Un projet est à l’étude en Mer de Marmara.
top concept of: Infrastructures de Recherche et composantes
type: Infra recherche

EMBRC-FR
type: Concept
type: Infra recherche
in scheme: Infrastructures de Recherche et composantes
top concept of: Infrastructures de Recherche et composantes
related: Pôle ODATIS

EURO-ARGO/ARGO
type: Concept
type: Infra euro
in scheme: Infrastructures de Recherche et composantes
top concept of: Infrastructures de Recherche et composantes
related: Pôle ODATIS

Euro-ARGO France
type: Infra recherche etoile
in scheme: Infrastructures de Recherche et composantes
top concept of: Infrastructures de Recherche et composantes
related: EURO-ARGO/ARGO
type: Concept
related: Pôle ODATIS
description: Argo France réunit l’ensemble des contributions françaises au programme international Argo, c’est à dire les activités de coordination scientifique et technique, achat et déploiement de flotteurs, traitement des données et interfaces avec la communauté utilisatrice (océanographie opérationnelle avec Mercator Océan et recherche). Outre le traitement de ses propres flotteurs, la France assure des fonctions importantes de traitement de données pour ses partenaires européens et internationaux (centre de données Coriolis). Argo-France est coordonnée au sein de la structure inter-organismes Coriolis (Ifremer, CEREMA, CNES, CNRS/INSU, IPEV, IRD, Météo France, SHOM) et est labellisé depuis 2011 par l’INSU comme Service National d’Observation (SNO) pour la Recherche (OSU IUEM). L’IR* Euro-Argo regroupe la composante nationale Argo France et la contribution française à la coordination de l’ERIC Euro-Argo. L’ERIC (European Research Infrastructure Consortium) Euro-Argo est la contribution européenne au réseau international Argo. L’ambition de la France est de contribuer à environ 10 % du programme Argo (soit 30 % des efforts européens) en déployant 80 flotteurs/an répartis de la manière suivante : 30 flotteurs standards (T,S-2 000 m), 15 flotteurs profonds (T,S,oxygène, 0-4 000 m), 35 flotteurs biogéochimiques (BGC, 0-2 000 m) dont 20 avec un capteur d’oxygène seul.
related: DATA TERRA

eLTER
type: RegisterItem
status: statusExperimental
register: Infrastructures de Recherche et composantes
item class: Concept
definition:
  entity: eLTER
  source graph: graph
notation: c_3e7709da
modified: 2023-12-14T16:13:16.117Z
item class: Infra euro
version info: 5
date accepted: 2022-04-07T14:48:34.49Z
date submitted: 2022-04-06T15:31:47.532Z
submitter: Hélène Bressan

ACTRIS-FR
type: RegisterItem
description: ACTRIS-FR est la composante française d’ACTRIS pour l’observation et l’exploration des aérosols, des nuages et des gaz réactifs et de leurs interactions. ACTRIS est une infrastructure de recherche européenne distribuée, en support des recherches sur le climat et la qualité de l’air. Elle permet d’améliorer la compréhension de l’évolution des processus et de la composition atmosphériques. ACTRIS fournit aux utilisateurs des informations sur la variabilité 4-D des espèces à temps de vie court avec un haut niveau de qualité, issues de plateformes d’observation et d’exploration. ACTRIS opère des plateformes centrales (centres de données et de calibration) et fournit des services destinés à une large communauté d’utilisateurs travaillant sur les modèles chimie/climat, sur la validation des données satellitaires ou sur l’analyse de la prévision du temps ou de la qualité de l’air. Enfin, ACTRIS propose des accès physiques ou à distance à ses plateformes au service des communautés scientifiques et du secteur privé favorisant ainsi la recherche, la formation et l’innovation technologique
date accepted: 2022-04-07T14:48:34.527Z
submitter: Hélène Bressan
version info: 4
status: statusExperimental
date submitted: 2022-04-06T15:31:47.592Z
notation: c_d4212c6b
modified: 2023-09-19T07:44:54.153Z
register: Infrastructures de Recherche et composantes
item class: Concept
definition:
  entity: ACTRIS-FR
  source graph: graph
item class: Infra recherche

EMSO
type: RegisterItem
register: Infrastructures de Recherche et composantes
notation: c_82e05a88
item class: Infra euro
item class: Concept
date accepted: 2022-04-07T14:48:34.514Z
date submitted: 2022-04-06T15:31:47.743Z
definition:
  entity: EMSO
  source graph: graph
version info: 4
modified: 2023-09-19T07:44:54.099Z
status: statusExperimental
submitter: Hélène Bressan

In-SYLVA-FR
type: RegisterItem
status: statusExperimental
notation: c_1377fbe6
description: In-Sylva France est une Infrastructure Nationale de recherche (IR) distribuée pour la gestion adaptative des forêts. Elle contribue à favoriser une vision intégrée de la gestion des forêts pour permettre son adaptation au changement climatique, la protection de sa biodiversité et la production durable de services écosystémiques, prenant en compte la diversité des écosystèmes forestiers et des situations locales (pédoclimatiques, organisation filières, gouvernances locales). In-Sylva France procure des services pour l’observation et l’expérimentation forestière à tous les utilisateurs (académiques et gestionnaires) impliqués dans le Programme national de la forêt et du bois (PNFB). L’infrastructure dispose de réseaux expérimentaux nécessaires au phénotypage à grande échelle (Services In-situ), c’est-à-dire sur plus de 4 000 ha soit 3 000 sites installés pour étudier les interactions entre pratiques, ressources génétiques et environnement. Elle intègre des plateformes analytiques en écologie fonctionnelle, biogéochimie, xylosciences et génétique, dédiées aux mesures à haut-débit d’échantillons (Services In-lab) ainsi que de systèmes d’information et d’analyses pour la valorisation des données (Services In-silico). In-Sylva France alimente la recherche fondamentale et appliquée dans le domaine des sciences forestières. Son originalité est de coupler les leviers sylvicoles, biogéochimiques et génétiques. https://doi.org/10.15454/1A0P-HE21
item class: Infra recherche
date accepted: 2022-04-07T14:48:34.474Z
item class: Concept
date submitted: 2022-04-06T15:31:47.727Z
modified: 2023-11-10T09:08:38.227Z
version info: 5
definition:
  entity: In-SYLVA-FR
  source graph: graph
register: Infrastructures de Recherche et composantes
submitter: Hélène Bressan

ICOS
type: RegisterItem
item class: Concept
register: Infrastructures de Recherche et composantes
modified: 2023-09-19T07:44:54.079Z
notation: c_14effe15
version info: 4
definition:
  entity: ICOS
  source graph: graph
submitter: Hélène Bressan
item class: Infra euro
date submitted: 2022-04-06T15:31:47.498Z
date accepted: 2022-04-07T14:48:34.482Z
status: statusExperimental

ANAEE
type: RegisterItem
modified: 2023-09-19T07:44:54.128Z
status: statusExperimental
register: Infrastructures de Recherche et composantes
definition:
  entity: ANAEE
  source graph: graph
notation: c_adcea323
item class: Infra euro
version info: 4
submitter: Hélène Bressan
date accepted: 2022-04-07T14:48:34.516Z
item class: Concept
date submitted: 2022-04-06T15:31:47.544Z

RégEF
type: RegisterItem
date accepted: 2022-04-07T14:48:34.515Z
definition:
  entity: RégEF
  source graph: graph
notation: c_975f54bc
date submitted: 2022-04-06T15:31:47.689Z
submitter: Hélène Bressan
status: statusExperimental
item class: Projet infra
modified: 2023-09-19T07:44:54.115Z
register: Infrastructures de Recherche et composantes
version info: 4
item class: Concept

eLTER-FR OZCAR
type: RegisterItem
version info: 5
date accepted: 2022-04-07T14:48:34.483Z
date submitted: 2022-04-06T15:31:47.694Z
definition:
  entity: eLTER-FR OZCAR
  source graph: graph
modified: 2023-11-10T09:05:19.442Z
register: Infrastructures de Recherche et composantes
notation: c_1b2adea3
status: statusExperimental
item class: Infra recherche
description: eLTER-France OZCAR est une IR distribuée mettant en réseau des sites instrumentant, sur le long terme, les différents compartiments de la Zone Critique des surfaces continentales : sol, sous-sol, eau, zones humides et glace. Il s’agit de mesurer en continu, modéliser et gérer les flux d’eau, de carbone et des éléments associés. Ces observatoires, véritables sentinelles des changements globaux, permettent d’aborder les grands enjeux scientifiques visant à une meilleure compréhension intégrée des stocks et des flux d’énergie et de matière à la surface des continents le long de gradients climatiques, topographiques, géologiques ou d’utilisation des terres. eLTER-France OZCAR est une IR essentielle pour obtenir une vision élargie et consolidée des changements environnementaux à l’œuvre sur les surfaces continentales, à l’échelle des territoires («des milieux»). Elle associe des observatoires de recherche élémentaires portés par les différents organismes de recherche qui les soutiennent. Elle offre une gouvernance et une méthodologie partagées au service de l’étude du fonctionnement et de l’évolution de la Zone Critique à l’heure de l’Anthropocène, pour la recherche, l’appui aux politiques publiques et le monde économique. Les services concernent la mise à disposition de sites densément instrumentés, le partage de leurs données, le partage d’un parc instrumental et l’innovation technologique, et la modélisation intégrée de la Zone Critique.
item class: Concept
submitter: Hélène Bressan

eLTER-FR RZA
type: RegisterItem
version info: 4
description: Le Réseau des Zones Ateliers (RZA, CNRS-INEE) incarne en France la recherche sur les socio-écosystèmes et le développement des sciences de la soutenabilité (Plateformes LTSER). Il aborde le fonctionnement et l’évolution des socio-écosystèmes sous l’emprise des différentes facettes du changement global. En appui très fort sur des approches disciplinaires au sein des champs des sciences de la nature (avec un accent marqué sur l’écologie) comme des sciences humaines et sociales (géographie, économie et droit, avec des ouvertures de plus en plus fortes vers la sociologie, l’anthropologie et les sciences sociales du politique), les ZAs stimulent des approches véritablement interdisciplinaires et des co-recherches entre chercheurs et acteurs des territoires. Le RZA et la diversité des ZAs qui le composent se veut donc à la fois (i) une mosaïque de laboratoires à ciel ouvert où ces approches inter- et transdisciplinaires peuvent se déployer, être testées pour accompagner les territoires dans leur transformation vers davantage de soutenabilité et (ii) un terrain pour penser en inter-ZA la question des changements d’échelle à travers des études comparatives et/ou le test d’hypothèses sur le fonctionnement et l’évolution des socio-écosystèmes, le long de gradients qui peuvent être climatiques, anthropiques, ou d’historique des relations chercheurs-acteurs. Le RZA, devenu IR en 2018, contribue avec l’IR OZCAR à la feuille de route européenne ESFRI via le nœud français d’eLTER.
item class: Infra recherche
definition:
  entity: eLTER-FR RZA
  source graph: graph
item class: Concept
date accepted: 2022-04-07T14:48:34.535Z
status: statusExperimental
modified: 2023-09-19T07:44:54.168Z
notation: c_df45bbba
date submitted: 2022-04-06T15:31:47.595Z
register: Infrastructures de Recherche et composantes
submitter: Hélène Bressan

EPOS
type: RegisterItem
date submitted: 2022-04-06T15:31:47.579Z
item class: Concept
modified: 2023-09-19T07:44:54.092Z
date accepted: 2022-04-07T14:48:34.501Z
status: statusExperimental
submitter: Hélène Bressan
notation: c_5cf373a0
item class: Infra euro
register: Infrastructures de Recherche et composantes
definition:
  entity: EPOS
  source graph: graph
version info: 4

IAGOS-FR
type: RegisterItem
modified: 2023-09-19T07:44:54.134Z
item class: Infra recherche
date accepted: 2022-04-07T14:48:34.534Z
status: statusExperimental
description: IAGOS est une infrastructure de recherche européenne, unique au monde, qui a pour objectif d’établir et d’opérer un réseau global d’observation à long terme de la composition de l’atmosphère : gaz traces réactifs (ozone, CO, NOx), gaz à effet de serre (H2O, CO2, méthane), aérosols et particules nuageuses (gouttes d’eau et cristaux de glace) grâce à des instruments automatiques embarqués sur une flotte d’une quinzaine d’avions de ligne (de type Airbus) appartenant à des compagnies aériennes internationales. Le but est de construire la plus dense base de données in-situ à haute résolution spatiale et temporelle sur plusieurs décennies pour surveiller l’évolution de la composition atmosphérique impliquée dans le changement climatique et la qualité de l’air. IAGOS a su démontrer que le vecteur avion commercial était la plateforme idéale pour des mesures in-situ à long terme dans la zone de l’atmosphère la plus critique vis-à-vis de l’effet de serre (la haute troposphère – basse stratosphère). Les mesures fournissent aussi des profils verticaux dans toute la troposphère entre la surface et 12 km d’altitude d’intérêt majeur pour les questions de qualité de l’air. Fin 2021, la base de données regroupe plus de 63 000 vols couvrant déjà plus de 25 ans. Ces observations sont exploitées par la communauté scientifique, les centres de prévisions météorologiques et de prévision de la qualité de l’air, le Service Atmosphérique du programme Copernicus (CAMS), et plus largement par GEOSS.
submitter: Hélène Bressan
date submitted: 2022-04-06T15:31:47.608Z
definition:
  entity: IAGOS-FR
  source graph: graph
register: Infrastructures de Recherche et composantes
version info: 4
item class: Concept
notation: c_db251932

Pôle AERIS
type: RegisterItem
date submitted: 2022-04-06T15:31:47.629Z
submitter: Hélène Bressan
status: statusExperimental
modified: 2024-04-11T11:07:11.1Z
definition:
  entity: Pôle AERIS
  source graph: graph
notation: c_0a3d49be
item class: Concept
version info: 5
date accepted: 2022-04-07T14:48:34.46Z
label: Pole AERIS @en
register: Infrastructures de Recherche et composantes

MIRRI
type: RegisterItem
modified: 2023-09-19T07:44:54.072Z
date accepted: 2022-04-07T14:48:34.526Z
notation: c_c84eb109
definition:
  entity: MIRRI
  source graph: graph
version info: 4
date submitted: 2022-04-06T15:31:47.669Z
item class: Concept
status: statusExperimental
item class: Infra euro
submitter: Hélène Bressan
register: Infrastructures de Recherche et composantes

CLIMERI-France
type: RegisterItem
status: statusExperimental
item class: Infra recherche
date accepted: 2022-04-07T14:48:34.468Z
submitter: Hélène Bressan
date submitted: 2022-04-06T15:31:47.677Z
version info: 4
notation: c_11d72d89
description: CLIMERI-France est l’infrastructure de recherche nationale de modélisation du climat. Elle a pour mission la réalisation des simulations numériques internationales du Programme mondial de recherches sur le climat et la mise à disposition de leurs résultats. Ces expériences visent à comprendre le fonctionnement du système climatique, à évaluer les capacités des modèles de climat, à soutenir des études de mécanismes et de processus et à produire des projections de l’évolution future du climat. Ces expériences servent de référence pour les recherches en sciences du climat mais également pour des études d’impact du changement climatique dans différents secteurs, et contribuent à l’élaboration des rapports du GIEC. CLIMERI-France inclut les ressources humaines assurant la mise au point et la maintenance des codes et des outils nécessaires à leur utilisation, la préparation des versions de référence des codes, les outils d’’exploitation des données produites par les simulations, les ressources de calcul permettant la réalisation des expériences internationales et les capacités de stockage des données, en partie mis à disposition par GENCI, ainsi que l’infrastructure logicielle permettant la gestion et le contrôle du flux de données et de métadonnées. L’infrastructure met à disposition des codes numériques et des outils logiciels. Elle offre un service d’accès aux données et à une plateforme d’analyse des résultats des modèles climatiques globaux et régionaux.
register: Infrastructures de Recherche et composantes
modified: 2023-09-19T07:44:54.069Z
definition:
  entity: CLIMERI-France
  source graph: graph
item class: Concept

ILICO
type: RegisterItem
version info: 5
submitter: Hélène Bressan
date accepted: 2022-04-07T14:48:34.512Z
notation: c_70f4ed6a
date submitted: 2022-04-06T15:31:47.488Z
status: statusExperimental
modified: 2023-11-10T09:06:36.146Z
register: Infrastructures de Recherche et composantes
description: L’infrastructure de recherche littorale et côtière (ILICO) est l’infrastructure de recherche française dédiée à l’observation et à la compréhension des évolutions à long-terme des milieux marins côtiers et littoraux, de métropole et outre-mer. ILICO occupe une position stratégique de structuration de l’observation et de la recherche sur les milieux naturels situés à l’interface entre le Continent et l’Océan. L’IR fédère des dispositifs d’observation inter-organismes pérennes (dont 8 «Services Nationaux d’Observation» (SNO) labellisés). ILICO a également pour mission de veiller à ce que les observations dans les milieux littoraux et côtiers répondent aux enjeux sociétaux et questions scientifiques associées. Elle est garant de l’interopérabilité et de la qualité des observations effectuées par les différents systèmes d’observation. ILICO pilote un réseau d’animation scientifique qui assure la réflexion et la prospective scientifique transversale, et favorise l’interdisciplinarité, via des actions structurantes transversales. Ce réseau inter-organismes est composé de plus de 60 laboratoires (implantés en métropole et en outre-mer) qui mènent une recherche sur les milieux marins côtiers et littoraux. L’IR ILICO est le nœud français du projet d’infrastructure européenne en cours de construction JERICO-RI (Joint European Research Infrastructure for Coastal Observatories).
item class: Concept
definition:
  entity: ILICO
  source graph: graph
item class: Infra recherche

Jerico-S3
type: RegisterItem
definition:
  entity: Jerico-S3
  source graph: graph
modified: 2023-09-19T07:44:54.102Z
submitter: Hélène Bressan
item class: Concept
date submitted: 2022-04-06T15:31:47.618Z
item class: Infra euro
date accepted: 2022-04-07T14:48:34.525Z
version info: 4
register: Infrastructures de Recherche et composantes
status: statusExperimental
notation: c_bbf0b3fa

CEPMMT
type: RegisterItem
modified: 2023-09-19T07:44:54.105Z
definition:
  entity: CEPMMT
  source graph: graph
item class: OI
submitter: Hélène Bressan
item class: Concept
register: Infrastructures de Recherche et composantes
date submitted: 2022-04-06T15:31:47.573Z
status: statusExperimental
version info: 5
description: Le Centre Européen pour les Prévisions Météorologiques à Moyen Terme est une organisation intergouvernementale indépendante créée en 1975 et actuellement financée par 34 États Membres. C’est à la fois un institut de recherche et un service opérationnel qui développe son modèle et son système global de Prévision Numérique du Temps, et l’opère 24h/24 7 j/7 pour élaborer et diffuser ses produits. Son centre de calcul et de données (ainsi que l’ensemble de l’archive correspondante) est accessible à tous ses États membres pour leurs activités de recherche. De ce fait, le CEPMMT est aussi un outil important pour la recherche sur le climat, et réalise notamment des ré-analyses du climat récent, basées sur son système de Prévision Numérique du Temps et l’ensemble des observations passées disponibles. Par ailleurs, le CEPMMT coordonne et met en œuvre les services atmosphère (chimie de l’atmosphère, qualité de l’air, émissions de gaz à effet de serre) et changement climatique du programme Copernicus de l’Union Européenne.
notation: c_ad65b5ae
date accepted: 2022-04-07T14:48:34.515Z

ANAEE-FR
type: RegisterItem
notation: c_ea7a6df2
register: Infrastructures de Recherche et composantes
item class: Infra recherche
date accepted: 2022-04-07T14:48:34.536Z
submitter: Hélène Bressan
date submitted: 2022-04-06T15:31:47.505Z
status: statusExperimental
definition:
  entity: ANAEE-FR
  source graph: graph
item class: Concept
modified: 2023-09-19T07:44:54.084Z
description: L’infrastructure AnaEE France offre à la communauté scientifique, aux entreprises et aux organisations issues de la société civile un accès à des dispositifs expérimentaux dédiés à l’étude des écosystèmes continentaux terrestres et aquatiques et distribuées sur le territoire national métropolitain et ultramarin. L’infrastructure accompagne également la réalisation des projets de recherche en proposant un accès aux données et à ses plateformes analytiques. Spécifiquement, AnaEE France rassemble 33 dispositifs originaux permettant de manipuler les écosystèmes soit en conditions plus ou moins contrôlées soit en milieu ouvert en accédant à des expérimentations long terme offrant des milieux différentiés et des historiques documentés ou en réalisant des expérimentations nouvelles notamment dans des écosystèmes alpins et des forêts tropicales. Les plateformes AnaEE France offrent des outils de pointe de caractérisation des écosystèmes afin d’appréhender simultanément les variables d’état relatives aux organismes vivants et aux milieux, et les flux de matière et d’énergie. La capacité de caractérisation des écosystèmes est accrue au sein de l’infrastructure par la mise à disposition de 7 plateformes analytiques en laboratoire ou in situ dans le domaine de la génomique environnementale, de la biochimie des sols et de l’analyse des gaz. Pour valoriser les données acquises, l’infrastructure propose un système d’information permettant une diffusion ouverte selon les principes FAIR.
version info: 4

Pôle ODATIS
type: RegisterItem
date submitted: 2022-04-06T15:31:47.738Z
version info: 5
submitter: Hélène Bressan
date accepted: 2022-04-07T14:48:34.542Z
definition:
  entity: Pôle ODATIS
  source graph: graph
modified: 2024-04-11T11:06:22.716Z
notation: c_ee292102
item class: Concept
label: Pole ODATIS @en
register: Infrastructures de Recherche et composantes
status: statusExperimental

Euro-ARGO France
type: RegisterItem
status: statusExperimental
modified: 2023-11-10T09:11:38.168Z
register: Infrastructures de Recherche et composantes
date accepted: 2022-04-07T14:48:34.5Z
date submitted: 2022-04-06T15:31:47.565Z
submitter: Hélène Bressan
item class: Concept
version info: 5
notation: c_53e0c4ee
item class: Infra recherche etoile
definition:
  entity: Euro-ARGO France
  source graph: graph
description: Argo France réunit l’ensemble des contributions françaises au programme international Argo, c’est à dire les activités de coordination scientifique et technique, achat et déploiement de flotteurs, traitement des données et interfaces avec la communauté utilisatrice (océanographie opérationnelle avec Mercator Océan et recherche). Outre le traitement de ses propres flotteurs, la France assure des fonctions importantes de traitement de données pour ses partenaires européens et internationaux (centre de données Coriolis). Argo-France est coordonnée au sein de la structure inter-organismes Coriolis (Ifremer, CEREMA, CNES, CNRS/INSU, IPEV, IRD, Météo France, SHOM) et est labellisé depuis 2011 par l’INSU comme Service National d’Observation (SNO) pour la Recherche (OSU IUEM). L’IR* Euro-Argo regroupe la composante nationale Argo France et la contribution française à la coordination de l’ERIC Euro-Argo. L’ERIC (European Research Infrastructure Consortium) Euro-Argo est la contribution européenne au réseau international Argo. L’ambition de la France est de contribuer à environ 10 % du programme Argo (soit 30 % des efforts européens) en déployant 80 flotteurs/an répartis de la manière suivante : 30 flotteurs standards (T,S-2 000 m), 15 flotteurs profonds (T,S,oxygène, 0-4 000 m), 35 flotteurs biogéochimiques (BGC, 0-2 000 m) dont 20 avec un capteur d’oxygène seul.

RARe
type: RegisterItem
notation: c_4f9fa17a
register: Infrastructures de Recherche et composantes
submitter: Hélène Bressan
item class: Infra recherche
status: statusExperimental
date accepted: 2022-04-07T14:48:34.499Z
version info: 5
item class: Concept
definition:
  entity: RARe
  source graph: graph
date submitted: 2022-04-06T15:31:47.711Z
description: RARe est l’infrastructure de référence pour sécuriser, documenter et distribuer les ressources de la biosphère du système Terre. Elle rassemble cinq réseaux de Centres de Ressources Biologiques (CRB) gérant des ressources biologiques animales, végétales, forestières, microbiennes et des matrices complexes issues de l’environnement, ainsi que les données associées (biologiques, génétiques, réglementaires et juridiques). Elle dispose d’un portail d’entrée unique qui permet d’explorer ces ressources. Le maintien d’une grande diversité de ressources place les CRB au cœur de nombreux programmes de recherche destinés à explorer le vivant et les écosystèmes et à valoriser la biodiversité pour l’agriculture, l’alimentation, l’environnement et la santé. L’infrastructure a pour but d’améliorer la visibilité de ces ressources et de faciliter leur utilisation pour la recherche au niveau national et international. Elle est membre du GGBN. Le pilier microbien de RARe participe à l’infrastructure MIRRI de la feuille de route ESFRI. Ces missions s’accompagnent d’une animation scientifique intersectorielle et de développements technologiques pour préserver et caractériser les ressources biologiques. L’infrastructure mutualise les compétences entre ses CRB constitutifs et harmonise leurs pratiques. La valorisation des ressources est réalisée en cohérence avec les politiques partenariales des organismes de tutelle. Elle propose des outils pour faciliter l’application du protocole de Nagoya
modified: 2023-11-10T09:07:58.579Z

ICOS-FR
type: RegisterItem
status: statusExperimental
definition:
  entity: ICOS-FR
  source graph: graph
modified: 2023-09-19T07:44:54.131Z
item class: Infra recherche etoile
date accepted: 2022-04-07T14:48:34.544Z
description: La mission de l’infrastructure ICOS est d’observer à haute résolution spatiale et au pas de temps journalier les variations des flux surface-atmosphère et des concentrations atmosphériques en gaz à effet de serre. L’infrastructure se compose d’un réseau de monitoring de haute précision, standardisé et à long terme des flux et concentrations en gaz à effet de serre. Elle intègre des observations standardisées de l’atmosphère, des surfaces continentales et des eaux de surface océaniques. Les observations produites par ICOS et mises à disposition de la communauté scientifique permettent d’explorer les processus à l’origine des échanges atmosphériques des océans et continents, de distinguer les composantes biogéniques, géophysiques et fossiles et d’observer les processus de transport atmosphérique. Elles participent aux observations globales de l’atmosphère terrestre et du climat. Les données produites par ICOS-RI constituent la base du suivi temporel spatialisé à haute résolution des émissions de gaz à effet de serre. Elles s’appliquent à l’estimation de bilans territoriaux, régionaux, nationaux et globaux de gaz à effet de serre et contribuent à la vérification des politiques énergétiques.
submitter: Hélène Bressan
notation: c_f7be2621
date submitted: 2022-04-06T15:31:47.742Z
version info: 4
item class: Concept
register: Infrastructures de Recherche et composantes

Partenaire européen
type: RegisterItem
version info: 4
modified: 2023-09-19T07:44:54.145Z
register: Infrastructures de Recherche et composantes
description: Partenaire européen d'un projet coordonné par Data Terra
status: statusExperimental
label: European partner @en
submitter: Elsa David
date accepted: 2022-04-11T09:04:34.586Z
notation: c_eb8e2bdc
date submitted: 2022-04-11T09:03:12.855Z
definition:
  entity: Partenaire européen
  source graph: graph
item class: Concept

Partenaire européen
type: Concept
description: Partenaire européen d'un projet coordonné par Data Terra
label: European partner @en
in scheme: Infrastructures de Recherche et composantes
top concept of: Infrastructures de Recherche et composantes
related: DATA TERRA

Pôle FORM@TER
type: RegisterItem
submitter: Hélène Bressan
date accepted: 2022-04-07T14:48:34.467Z
notation: c_0b54e086
definition:
  entity: Pôle FORM@TER
  source graph: graph
item class: Concept
version info: 5
modified: 2024-04-11T11:06:01.621Z
register: Infrastructures de Recherche et composantes
status: statusExperimental
date submitted: 2022-04-06T15:31:47.604Z

EMSO-FR
type: RegisterItem
date submitted: 2022-04-06T15:31:47.523Z
submitter: Hélène Bressan
item class: Concept
version info: 5
description: EMSO France est le nœud français de l’infrastructure Européenne (ERIC) EMSO (« European Multidisciplinary Seafloor and water column Observatory ») qui met en œuvre les observatoires marins pluridisciplinaires distribués en milieu profond sur le pourtour européen. L’ERIC EMSO a pour objectif d’acquérir des séries temporelles longues et haute fréquence sur un point donné, à la fois sur le fond de l’océan et dans la colonne d’eau avec pour objectifs scientifiques principaux : 1) l’étude des processus sismiques, volcaniques, hydrothermaux et gravitaires ; 2) l’étude des écosystèmes marins profonds dans une optique de recherche fondamentale mais aussi de gestion durable, en particulier vis-à-vis des facteurs anthropiques et climatiques ; 3) la contribution au suivi des changements globaux. Sur chaque site, les installations sont composées d’équipements permettant d’acquérir les données d’observation en milieu marin profond, de systèmes qui assurent la communication bidirectionnelle entre les installations en mer et la Terre et des plateformes sur lesquelles les données acquises sont en accès libre. Les sites EMSO France sont situés aux Açores (depuis 2010), en mer Ligure (depuis 1988), en mer d’Iroise (site de test). Un projet est à l’étude en Mer de Marmara.
register: Infrastructures de Recherche et composantes
notation: c_1ce4e5d0
item class: Infra recherche
date accepted: 2022-04-07T14:48:34.484Z
status: statusExperimental
modified: 2023-11-08T13:53:12.72Z
definition:
  entity: EMSO-FR
  source graph: graph

Infrastructures de Recherche et composantes
type: RegisterItem
item class: Register
version info: 3
description: liste des IRs et de leur composantes en fonction de la feuille de route du ministère https://www.enseignementsup-recherche.gouv.fr/sites/default/files/2022-03/feuille-de-route-nationale-des-infrastructures-de-recherche---2021-17054.pdf
date accepted: 2022-04-07T14:48:13.029Z
item class: Container
date submitted: 2022-04-06T15:31:47.333Z
register: DataTerraRepositoryFairIncubator
item class: ConceptScheme
modified: 2022-04-06T15:36:48.976Z
status: statusExperimental
submitter: Hélène Bressan
definition:
  entity: Infrastructures de Recherche et composantes
  entity version: InfraRecherche:3
notation: InfraRecherche

ACTRIS
type: RegisterItem
version info: 4
modified: 2023-09-19T07:44:54.112Z
register: Infrastructures de Recherche et composantes
date accepted: 2022-04-07T14:48:34.491Z
notation: c_48fd7b5f
submitter: Hélène Bressan
definition:
  entity: ACTRIS
  source graph: graph
date submitted: 2022-04-06T15:31:47.616Z
status: statusExperimental
item class: Concept
item class: Infra euro

EMPHASIS-FR
type: RegisterItem
register: Infrastructures de Recherche et composantes
date accepted: 2022-04-07T14:48:34.526Z
definition:
  entity: EMPHASIS-FR
  source graph: graph
status: statusExperimental
date submitted: 2022-04-06T15:31:47.551Z
modified: 2023-11-10T09:07:20.962Z
submitter: Hélène Bressan
version info: 5
item class: Concept
notation: c_bf673b93
item class: Infra recherche

DATA TERRA
type: RegisterItem
definition:
  entity: DATA TERRA
  source graph: graph
description: Le système Terre est un système complexe intégrant des milieux physiques et vivants qui évoluent et interagissent entre eux à différentes échelles. Prévoir son évolution, anticiper les impacts et alerter des risques environnementaux sont des enjeux majeurs. Cela nécessite la collecte et l’analyse croisée de données issues de dispositifs d’observation (terre, mer, aéroporté, spatial), de modélisations et d’expérimentations. La complexité des processus étudiés, le nombre et la précision croissante des observations exigent d’intégrer des données multi-sources, multi-échelles, multi-types et de mieux quantifier leurs incertitudes. Data Terra, fondée sur quatre pôles (surfaces continentales, atmosphère, océans, Terre solide) et des services transversaux, développe un dispositif global d’accès et de traitement de données, produits et services pour : faciliter l’accès et l’utilisation de données et services FAIR, développer des services sur l’ensemble du cycle de la donnée et des approches interdisciplinaires pour les communautés scientifiques, les acteurs publiques et de l’innovation. Cette E-infrastructure du domaine de l’environnement – ouverte et interopérable – permet l’extraction, le croisement et un accès transparent et continu à des données multi-sources, multi-domaines et multi-organismes du système Terre. En Europe et à l’International, Data Terra contribue à EOSC, aux missions et applications spatiales et à la mise en œuvre de jumeaux numériques de la Terre.
submitter: Hélène Bressan
item class: Concept
register: Infrastructures de Recherche et composantes
status: statusExperimental
modified: 2024-04-11T10:57:10.331Z
date accepted: 2022-04-07T14:48:34.501Z
notation: c_5591b438
item class: Infra recherche
date submitted: 2022-04-06T15:31:47.513Z
version info: 5

PNDB
type: RegisterItem
submitter: Hélène Bressan
date accepted: 2022-04-07T14:48:34.486Z
item class: Infra recherche
version info: 5
notation: c_2316d52e
item class: Concept
modified: 2024-04-11T11:05:31.86Z
register: Infrastructures de Recherche et composantes
date submitted: 2022-04-06T15:31:47.68Z
description: Le PNDB est une infrastructure numérique nationale du Système Terre-Environnement, contribuant à la politique de Science ouverte du MESRI. Depuis 2020, il met à disposition un ensemble cohérent d’outils et services pour la description, la mise à disposition, la validation, l’analyse et la réutilisation des données de biodiversité, notamment à l’usage des recherches fondamentales ou finalisées. Il ambitionne de contribuer à construire un cadre scientifique intégratif prenant en compte la biodiversité sur le temps long (depuis les origines de la vie), à toutes les échelles biologiques (de la molécule à l’anthropo-écosystème), et dans toutes ses interactions (climat, activités humaines). Le PNDB a pour vocation de donner accès à des données produites par d’autres infrastructures, par des institutions ou par des communautés scientifiques, et à des outils permettant de les décrire (métadonnées) et de les traiter (croisement de données). Il contribue ainsi à favoriser la pérennité, l’interopérabilité, l’ouverture et la réutilisation des données de biodiversité, et à faire monter en compétence les communautés scientifiques concernées. Il offre une aide à la bancarisation. Il contribue à l’animation des communautés autour de la science ouverte et stimule les interactions entre producteurs et utilisateurs de données. La PNDB s’inscrit dans le paysage des infrastructures de données de biodiversité national (SIB, SINP, GBIF France…), européen (Lifewatch) et international (GBIF, GEO BON…).
definition:
  entity: PNDB
  source graph: graph
status: statusExperimental

IBISBA-FR
type: RegisterItem
date accepted: 2022-04-07T14:48:34.511Z
date submitted: 2022-04-06T15:31:47.535Z
modified: 2023-09-19T07:44:54.088Z
item class: Concept
version info: 4
submitter: Hélène Bressan
definition:
  entity: IBISBA-FR
  source graph: graph
item class: Infra recherche
register: Infrastructures de Recherche et composantes
status: statusExperimental
notation: c_6c8e9fe9

IAGOS
type: RegisterItem
item class: Concept
submitter: Hélène Bressan
version info: 4
notation: c_0046ba75
date accepted: 2022-04-07T14:48:34.453Z
modified: 2023-09-19T07:44:54.182Z
definition:
  entity: IAGOS
  source graph: graph
date submitted: 2022-04-06T15:31:47.702Z
item class: Infra euro
status: statusExperimental
register: Infrastructures de Recherche et composantes

Epos-France
type: RegisterItem
status: statusExperimental
submitter: Hélène Bressan
date submitted: 2023-11-10T11:07:37.797Z
register: Infrastructures de Recherche et composantes
description: L’infrastructure de recherche (IR) Epos-France a été créée en octobre 2023. Elle a succédé au Réseau sismologique et géodésique français Résif-Epos. Ses contours thématiques sont plus larges, en accord avec ceux de la grande sœur européenne, EPOS. Les thématiques présentes dans Résif ont d'ores et déjà intégré Epos-France. A terme, toutes les recherches en Terre solide ont vocation à trouver une place dans la nouvelle IR grâce au processus d’intégration mis en place.
version info: 3
notation: c_3d87e1669
predecessor: c 3d87e166
date accepted: 2023-11-10T11:07:56.792Z
item class: Concept
definition:
  entity: Epos-France
  source graph: graph
item class: Infra recherche

Epos-France
type: Concept
top concept of: Infrastructures de Recherche et composantes
description: L’infrastructure de recherche (IR) Epos-France a été créée en octobre 2023. Elle a succédé au Réseau sismologique et géodésique français Résif-Epos. Ses contours thématiques sont plus larges, en accord avec ceux de la grande sœur européenne, EPOS. Les thématiques présentes dans Résif ont d'ores et déjà intégré Epos-France. A terme, toutes les recherches en Terre solide ont vocation à trouver une place dans la nouvelle IR grâce au processus d’intégration mis en place.
type: Infra recherche
related: Pôle FORM@TER
related: EPOS
in scheme: Infrastructures de Recherche et composantes
related: DATA TERRA

Pôle THEIA
type: RegisterItem
notation: c_ee5f0bc7
submitter: Hélène Bressan
item class: Concept
label: Pole THEIA @en
status: statusExperimental
modified: 2024-04-11T11:06:42.434Z
definition:
  entity: Pôle THEIA
  source graph: graph
date submitted: 2022-04-06T15:31:47.704Z
date accepted: 2022-04-07T14:48:34.543Z
register: Infrastructures de Recherche et composantes
version info: 5

DISSCo
type: RegisterItem
date submitted: 2022-04-06T15:31:47.716Z
definition:
  entity: DISSCo
  source graph: graph
status: statusExperimental
notation: c_b285efc3
submitter: Hélène Bressan
date accepted: 2022-04-07T14:48:34.517Z
version info: 6
modified: 2023-11-10T09:05:56.558Z
item class: Concept
item class: Infra euro
register: Infrastructures de Recherche et composantes

EURO-ARGO/ARGO
type: RegisterItem
modified: 2023-09-19T07:44:54.157Z
definition:
  entity: EURO-ARGO/ARGO
  source graph: graph
date submitted: 2022-04-06T15:31:47.555Z
item class: Infra euro
notation: c_29cfb051
date accepted: 2022-04-07T14:48:34.488Z
item class: Concept
version info: 4
status: statusExperimental
register: Infrastructures de Recherche et composantes
submitter: Hélène Bressan

RECOLNAT
type: RegisterItem
item class: Concept
description: Les collections naturalistes conservées en France représentent environ 120 millions d’objets. Ces archives de la biodiversité et de la géodiversité représentent aujourd’hui un patrimoine irremplaçable et sont des atouts indéniables pour la recherche scientifique présente et future. L’infrastructure RECOLNAT a pour mission générale de produire, mobiliser, rassembler, harmoniser et donner accès aux collections naturalistes et à leurs données. L’ambition est de pouvoir proposer aux communautés scientifiques des données naturalistes de qualité, à la bonne échelle, interopérables et dans le bon format, permettant de répondre aux grands enjeux environnementaux et sociétaux. Aussi, RECOLNAT vise à constituer un réseau d’excellence scientifique en rassemblant les acteurs de la conservation et de l’étude des collections naturalistes. Elle donne accès aux données via un portail rassemblant près de 11 millions d’images provenant de plus de 80 institutions (muséums, universités, etc.). Ce corpus est aussi enrichi par le programme de sciences participatives «Les Herbonautes», dont la communauté constitue des jeux de données pour des travaux de recherche sélectionnés. L’infrastructure met également à disposition des outils pour les chercheurs travaillant sur les doubles numériques des collections. Piloté par le Muséum national d’histoire naturelle, RECOLNAT constitue également le point nodal français de l’infrastructure européenne DiSSCo (Distributed System of Scientific Collections).
register: Infrastructures de Recherche et composantes
date submitted: 2022-04-06T15:31:47.717Z
version info: 4
date accepted: 2022-04-07T14:48:34.507Z
definition:
  entity: RECOLNAT
  source graph: graph
notation: c_68bf660b
submitter: Hélène Bressan
status: statusExperimental
modified: 2023-09-19T07:44:54.124Z
item class: Infra recherche